Reaction Details
Target11-beta-hydroxysteroid dehydrogenase 1
LigandBDBM50335199
Substrate/Competitorn/a
Meas. Tech.ChEMBL_701687 (CHEMBL1656579)
Ki 143±n/a nM
Citation Starcevic, SBrozic, PTurk, SCesar, JRizner, TLGobec, S Synthesis and biological evaluation of (6- and 7-phenyl) coumarin derivatives as selective nonsteroidal inhibitors of 17ß-hydroxysteroid dehydrogenase type 1. J Med Chem54:248-61 (2011) 
 
11-beta-hydroxysteroid dehydrogenase 1
Name:11-beta-hydroxysteroid dehydrogenase 1
Type:Enzyme
Mol. Mass.:32409.16
Organism:Homo sapiens (Human)
Description:P28845
Residue:292
BDBM50335199
NameBDBM50335199
Synonyms:3-Acetyl-7-(4-hydroxyphenyl)-2H-chromen-2-one | CHEMBL1650702
TypeSmall organic molecule
Emp. Form.C17H12O4
Mol. Mass.280.2748
SMILESCC(=O)c1cc2ccc(cc2oc1=O)-c1ccc(O)cc1