Reaction Details
TargetAurora kinase B
LigandBDBM50335331
Substrate/Competitorn/a
Meas. Tech.ChEMBL_701579 (CHEMBL1656338)
IC50>100000±n/a nM
Citation Prime, MECourtney, SMBrookfield, FAMarston, RWWalker, VWarne, JBoyd, AEKairies, NAvon der Saal, WLimberg, AGeorges, GEngh, RAGoller, BRueger, PRueth, M Phthalazinone pyrazoles as potent, selective, and orally bioavailable inhibitors of Aurora-A kinase. J Med Chem54:312-9 (2011) 
 
Aurora kinase B
Name:Aurora kinase B
Type:Protein
Mol. Mass.:39327.72
Organism:Homo sapiens (Human)
Description:Q96GD4
Residue:344
BDBM50335331
NameBDBM50335331
Synonyms:2-(4-Methoxyphenyl)-4-(5-methyl-1H-pyrazol-3-ylamino)-2Hphthalazin-1-one | CHEMBL1651469
TypeSmall organic molecule
Emp. Form.C19H17N5O2
Mol. Mass.347.3706
SMILESCOc1ccc(cc1)-n1nc(Nc2cc(C)n[nH]2)c2ccccc2c1=O