Reaction Details
TargetAurora kinase B
LigandBDBM50335322
Substrate/Competitorn/a
Meas. Tech.ChEMBL_701579 (CHEMBL1656338)
IC50 28000±n/a nM
Citation Prime, MECourtney, SMBrookfield, FAMarston, RWWalker, VWarne, JBoyd, AEKairies, NAvon der Saal, WLimberg, AGeorges, GEngh, RAGoller, BRueger, PRueth, M Phthalazinone pyrazoles as potent, selective, and orally bioavailable inhibitors of Aurora-A kinase. J Med Chem54:312-9 (2011) 
 
Aurora kinase B
Name:Aurora kinase B
Type:Protein
Mol. Mass.:39327.72
Organism:Homo sapiens (Human)
Description:Q96GD4
Residue:344
BDBM50335322
NameBDBM50335322
Synonyms:2-(3-Methoxybenzyl)-4-(5-methyl-1H-pyrazol-3-ylamino)-2Hphthalazin-1-one | CHEMBL1651479
TypeSmall organic molecule
Emp. Form.C20H19N5O2
Mol. Mass.361.3972
SMILESCOc1cccc(Cn2nc(Nc3cc(C)n[nH]3)c3ccccc3c2=O)c1