Reaction Details
TargetAurora kinase B
LigandBDBM50335317
Substrate/Competitorn/a
Meas. Tech.ChEMBL_701579 (CHEMBL1656338)
IC50 15000±n/a nM
Citation Prime, MECourtney, SMBrookfield, FAMarston, RWWalker, VWarne, JBoyd, AEKairies, NAvon der Saal, WLimberg, AGeorges, GEngh, RAGoller, BRueger, PRueth, M Phthalazinone pyrazoles as potent, selective, and orally bioavailable inhibitors of Aurora-A kinase. J Med Chem54:312-9 (2011) 
 
Aurora kinase B
Name:Aurora kinase B
Type:Protein
Mol. Mass.:39327.72
Organism:Homo sapiens (Human)
Description:Q96GD4
Residue:344
BDBM50335317
NameBDBM50335317
Synonyms:CHEMBL1651480 | N-{4-[1-Oxo-4-(1H-pyrazol-3-ylamino)-1H-phthalazin-2-ylmethyl]phenyl}acetamide
TypeSmall organic molecule
Emp. Form.C21H20N6O2
Mol. Mass.388.4225
SMILESCC(=O)Nc1ccc(Cn2nc(Nc3cc(C)n[nH]3)c3ccccc3c2=O)cc1