Reaction Details
TargetAurora kinase A
LigandBDBM50335334
Substrate/Competitorn/a
Meas. Tech.ChEMBL_701578 (CHEMBL1656337)
IC50 37±n/a nM
Citation Prime, MECourtney, SMBrookfield, FAMarston, RWWalker, VWarne, JBoyd, AEKairies, NAvon der Saal, WLimberg, AGeorges, GEngh, RAGoller, BRueger, PRueth, M Phthalazinone pyrazoles as potent, selective, and orally bioavailable inhibitors of Aurora-A kinase. J Med Chem54:312-9 (2011) 
 
Aurora kinase A
Name:Aurora kinase A
Type:Serine/threonine-protein kinase
Mol. Mass.:45830.98
Organism:Homo sapiens (Human)
Description:O14965
Residue:403
BDBM50335334
NameBDBM50335334
Synonyms:2-(4-Fluorophenyl)-4-(5-methyl-1H-pyrazol-3-ylamino)-2Hphthalazin-1-one | CHEMBL1651473
TypeSmall organic molecule
Emp. Form.C18H14FN5O
Mol. Mass.335.3351
SMILESCc1cc(Nc2nn(-c3ccc(F)cc3)c(=O)c3ccccc23)[nH]n1