Reaction Details
TargetAurora kinase A
LigandBDBM50335316
Substrate/Competitorn/a
Meas. Tech.ChEMBL_701578 (CHEMBL1656337)
IC50 14000±n/a nM
Citation Prime, MECourtney, SMBrookfield, FAMarston, RWWalker, VWarne, JBoyd, AEKairies, NAvon der Saal, WLimberg, AGeorges, GEngh, RAGoller, BRueger, PRueth, M Phthalazinone pyrazoles as potent, selective, and orally bioavailable inhibitors of Aurora-A kinase. J Med Chem54:312-9 (2011) 
 
Aurora kinase A
Name:Aurora kinase A
Type:Serine/threonine-protein kinase
Mol. Mass.:45830.98
Organism:Homo sapiens (Human)
Description:O14965
Residue:403
BDBM50335316
NameBDBM50335316
Synonyms:4-(1H-Indazol-3-ylamino)-2-phenyl-2H-phthalazin-1-one | CHEMBL1651475
TypeSmall organic molecule
Emp. Form.C21H15N5O
Mol. Mass.353.3767
SMILESO=c1n(nc(Nc2n[nH]c3ccccc23)c2ccccc12)-c1ccccc1