Reaction Details
TargetNociceptin receptor
LigandBDBM50335575
Substrate/Competitorn/a
Meas. Tech.ChEMBL_714493 (CHEMBL1659151)
EC50 8.9±n/a nM
Citation Hayashi, SNakata, EMorita, AMizuno, KYamamura, KKato, AOhashi, K Discovery of {1-[4-(2-{hexahydropyrrolo[3,4-c]pyrrol-2(1H)-yl}-1H-benzimidazol-1-yl)piperidin-1-yl]cyclooctyl}methanol, systemically potent novel non-peptide agonist of nociceptin/orphanin FQ receptor as analgesic for the treatment of neuropathic pain: design, synthesis, and structure-activity rela Bioorg Med Chem18:7675-99 (2010) 
 
Nociceptin receptor
Name:Nociceptin receptor
Type:G Protein-Coupled Receptor (GPCR)
Mol. Mass.:40702.87
Organism:Homo sapiens (Human)
Description:P41146
Residue:370
BDBM50335575
NameBDBM50335575
Synonyms:(1-{4-[2-(3-Chloro-4-fluorophenyl)-1H-benzimidazol-1-yl]piperidin-1-yl}cyclooctyl)methanol | CHEMBL1650842
TypeSmall organic molecule
Emp. Form.C27H33ClFN3O
Mol. Mass.470.022
SMILESOCC1(CCCCCCC1)N1CCC(CC1)n1c(nc2ccccc12)-c1ccc(F)c(Cl)c1