Reaction Details
TargetDelta-type opioid receptor
LigandBDBM50335568
Substrate/Competitorn/a
Meas. Tech.ChEMBL_714498 (CHEMBL1659156)
Ki>500±n/a nM
Citation Hayashi, SNakata, EMorita, AMizuno, KYamamura, KKato, AOhashi, K Discovery of {1-[4-(2-{hexahydropyrrolo[3,4-c]pyrrol-2(1H)-yl}-1H-benzimidazol-1-yl)piperidin-1-yl]cyclooctyl}methanol, systemically potent novel non-peptide agonist of nociceptin/orphanin FQ receptor as analgesic for the treatment of neuropathic pain: design, synthesis, and structure-activity rela Bioorg Med Chem18:7675-99 (2010) 
 
Delta-type opioid receptor
Name:Delta-type opioid receptor
Type:G Protein-Coupled Receptor (GPCR)
Mol. Mass.:40382.98
Organism:Homo sapiens (Human)
Description:Competition binding assays were carried out using membrane preparations from transfected HN9.10 cells that constitutively expressed the delta opioid receptor.
Residue:372
BDBM50335568
NameBDBM50335568
Synonyms:(1-{4-[2-(3-Methylpiperazin-1-yl)-1H-benzimidazol-1-yl]piperidin-1-yl}cyclooctyl)methanol | CHEMBL1650848
TypeSmall organic molecule
Emp. Form.C26H41N5O
Mol. Mass.439.6366
SMILESCC1CN(CCN1)c1nc2ccccc2n1C1CCN(CC1)C1(CO)CCCCCCC1