Reaction Details
TargetSmall conductance calcium-activated potassium channel protein 1
LigandBDBM50260153
Substrate/Competitorn/a
Meas. Tech.ChEMBL_714878 (CHEMBL1663824)
IC50 0.024000±n/a nM
Citation Hayashi, SNakata, EMorita, AMizuno, KYamamura, KKato, AOhashi, K Discovery of {1-[4-(2-{hexahydropyrrolo[3,4-c]pyrrol-2(1H)-yl}-1H-benzimidazol-1-yl)piperidin-1-yl]cyclooctyl}methanol, systemically potent novel non-peptide agonist of nociceptin/orphanin FQ receptor as analgesic for the treatment of neuropathic pain: design, synthesis, and structure-activity rela Bioorg Med Chem18:7675-99 (2010) 
 
Small conductance calcium-activated potassium channel protein 1
Name:Small conductance calcium-activated potassium channel protein 1
Type:Enzyme Catalytic Domain
Mol. Mass.:59231.59
Organism:RAT
Description:Potassium Channel, Ca2+ Act., VS 0 RAT::P70606
Residue:536
BDBM50260153
NameBDBM50260153
Synonyms:Apamin Octadecapeptide venom
TypeSmall organic molecule
Emp. Form.C79H131N31O24S4
Mol. Mass.2027.339
SMILESCC(C)C[C@@H]1NC(=O)[C@H](C)NC(=O)[C@@H](NC(=O)[C@H](CCC(O)=O)NC(=O)[C@@H]2CCCN2C(=O)[C@H](C)NC(=O)[C@H](CCCCN)NC(=O)[C@@H]2CSSC[C@H](NC(=O)[C@H](CCCN=C(N)N)NC(=O)[C@H](CCCN=C(N)N)NC(=O)[C@H](C)NC(=O)[C@H](CSSC[C@H](N)C(=O)N[C@@H](CC(N)=O)C(=O)N2)NC1=O)C(=O)N[C@@H](CCC(N)=O)C(=O)N[C@@H](CCC(N)=O)C(=O)N[C@@H](Cc1cnc[nH]1)C(N)=O)[C@@H](C)O