Reaction Details
TargetNociceptin receptor
LigandBDBM50335576
Substrate/Competitorn/a
Meas. Tech.ChEMBL_714495 (CHEMBL1659153)
Ki 4.3±n/a nM
Citation Hayashi, SNakata, EMorita, AMizuno, KYamamura, KKato, AOhashi, K Discovery of {1-[4-(2-{hexahydropyrrolo[3,4-c]pyrrol-2(1H)-yl}-1H-benzimidazol-1-yl)piperidin-1-yl]cyclooctyl}methanol, systemically potent novel non-peptide agonist of nociceptin/orphanin FQ receptor as analgesic for the treatment of neuropathic pain: design, synthesis, and structure-activity rela Bioorg Med Chem18:7675-99 (2010) 
 
Nociceptin receptor
Name:Nociceptin receptor
Type:G Protein-Coupled Receptor (GPCR)
Mol. Mass.:40702.87
Organism:Homo sapiens (Human)
Description:P41146
Residue:370
BDBM50335576
NameBDBM50335576
Synonyms:(1-{4-[2-(3-Chloro-4-fluorophenyl)-1H-benzimidazol-1-yl]piperidin-1-yl}cyclohexyl)methanol | CHEMBL1650849
TypeSmall organic molecule
Emp. Form.C25H29ClFN3O
Mol. Mass.441.969
SMILESOCC1(CCCCC1)N1CCC(CC1)n1c(nc2ccccc12)-c1ccc(F)c(Cl)c1