Reaction Details
TargetNociceptin receptor
LigandBDBM50335577
Substrate/Competitorn/a
Meas. Tech.ChEMBL_714495 (CHEMBL1659153)
Ki>250±n/a nM
Citation Hayashi, SNakata, EMorita, AMizuno, KYamamura, KKato, AOhashi, K Discovery of {1-[4-(2-{hexahydropyrrolo[3,4-c]pyrrol-2(1H)-yl}-1H-benzimidazol-1-yl)piperidin-1-yl]cyclooctyl}methanol, systemically potent novel non-peptide agonist of nociceptin/orphanin FQ receptor as analgesic for the treatment of neuropathic pain: design, synthesis, and structure-activity rela Bioorg Med Chem18:7675-99 (2010) 
 
Nociceptin receptor
Name:Nociceptin receptor
Type:G Protein-Coupled Receptor (GPCR)
Mol. Mass.:40702.87
Organism:Homo sapiens (Human)
Description:P41146
Residue:370
BDBM50335577
NameBDBM50335577
Synonyms:1-{4-[2-(4-Methylpiperazin-1-yl)-1H-benzimidazol-1-yl]-piperidin-1-yl}cyclooctanecarboxylic acid | CHEMBL1650850
TypeSmall organic molecule
Emp. Form.C26H39N5O2
Mol. Mass.453.6202
SMILESCN1CCN(CC1)c1nc2ccccc2n1C1CCN(CC1)C1(CCCCCCC1)C(O)=O