Reaction Details
TargetMu-type opioid receptor
LigandBDBM50335567
Substrate/Competitorn/a
Meas. Tech.ChEMBL_714496 (CHEMBL1659154)
Ki 229±n/a nM
Citation Hayashi, SNakata, EMorita, AMizuno, KYamamura, KKato, AOhashi, K Discovery of {1-[4-(2-{hexahydropyrrolo[3,4-c]pyrrol-2(1H)-yl}-1H-benzimidazol-1-yl)piperidin-1-yl]cyclooctyl}methanol, systemically potent novel non-peptide agonist of nociceptin/orphanin FQ receptor as analgesic for the treatment of neuropathic pain: design, synthesis, and structure-activity rela Bioorg Med Chem18:7675-99 (2010) 
 
Mu-type opioid receptor
Name:Mu-type opioid receptor
Type:G Protein-Coupled Receptor (GPCR)
Mol. Mass.:44789.51
Organism:Homo sapiens (Human)
Description:P35372
Residue:400
BDBM50335567
NameBDBM50335567
Synonyms:(1-{4-[2-(4-Methylpiperazin-1-yl)-1H-benzimidazol-1-yl]piperidin-1-yl}cyclooctyl)methanol | CHEMBL1650847
TypeSmall organic molecule
Emp. Form.C26H41N5O
Mol. Mass.439.6366
SMILESCN1CCN(CC1)c1nc2ccccc2n1C1CCN(CC1)C1(CO)CCCCCCC1