Reaction Details
TargetMu-type opioid receptor
LigandBDBM50335574
Substrate/Competitorn/a
Meas. Tech.ChEMBL_714496 (CHEMBL1659154)
Ki 178±n/a nM
Citation Hayashi, SNakata, EMorita, AMizuno, KYamamura, KKato, AOhashi, K Discovery of {1-[4-(2-{hexahydropyrrolo[3,4-c]pyrrol-2(1H)-yl}-1H-benzimidazol-1-yl)piperidin-1-yl]cyclooctyl}methanol, systemically potent novel non-peptide agonist of nociceptin/orphanin FQ receptor as analgesic for the treatment of neuropathic pain: design, synthesis, and structure-activity rela Bioorg Med Chem18:7675-99 (2010) 
 
Mu-type opioid receptor
Name:Mu-type opioid receptor
Type:G Protein-Coupled Receptor (GPCR)
Mol. Mass.:44789.51
Organism:Homo sapiens (Human)
Description:P35372
Residue:400
BDBM50335574
NameBDBM50335574
Synonyms:(1-{4-[2-(4-Chlorophenyl)-1H-benzimidazol-1-yl]piperidin-1-yl}cyclooctyl)methanol | CHEMBL1650843
TypeSmall organic molecule
Emp. Form.C27H34ClN3O
Mol. Mass.452.031
SMILESOCC1(CCCCCCC1)N1CCC(CC1)n1c(nc2ccccc12)-c1ccc(Cl)cc1