Reaction Details
TargetKappa-type opioid receptor
LigandBDBM50335573
Substrate/Competitorn/a
Meas. Tech.ChEMBL_714497 (CHEMBL1659155)
Ki 387±n/a nM
Citation Hayashi, SNakata, EMorita, AMizuno, KYamamura, KKato, AOhashi, K Discovery of {1-[4-(2-{hexahydropyrrolo[3,4-c]pyrrol-2(1H)-yl}-1H-benzimidazol-1-yl)piperidin-1-yl]cyclooctyl}methanol, systemically potent novel non-peptide agonist of nociceptin/orphanin FQ receptor as analgesic for the treatment of neuropathic pain: design, synthesis, and structure-activity rela Bioorg Med Chem18:7675-99 (2010) 
 
Kappa-type opioid receptor
Name:Kappa-type opioid receptor
Type:G Protein-Coupled Receptor (GPCR)
Mol. Mass.:42648.76
Organism:Homo sapiens (Human)
Description:P41145
Residue:380
BDBM50335573
NameBDBM50335573
Synonyms:(1-{4-[2-(3,3-Dimethylpiperazin-1-yl)-1H-benzimidazol-1-yl]piperidin-1-yl}cyclooctyl)methanol | CHEMBL1650841
TypeSmall organic molecule
Emp. Form.C27H43N5O
Mol. Mass.453.6632
SMILESCC1(C)CN(CCN1)c1nc2ccccc2n1C1CCN(CC1)C1(CO)CCCCCCC1