Reaction Details
TargetCytochrome P450 3A4
LigandBDBM50293603
Substrate/Competitorn/a
Meas. Tech.ChEMBL_717279 (CHEMBL1669902)
Ki 630±n/a nM
Citation McNulty, JThorat, AVurgun, NNair, JJMakaji, ECrankshaw, DJHolloway, ACPandey, S Human cytochrome P450 liability studies of trans-dihydronarciclasine: a readily available, potent, and selective cancer cell growth inhibitor. J Nat Prod74:106-8 (2011) 
 
Cytochrome P450 3A4
Name:Cytochrome P450 3A4
Type:Enzyme
Mol. Mass.:57349.57
Organism:Homo sapiens (Human)
Description:n/a
Residue:503
BDBM50293603
NameBDBM50293603
Synonyms:(2S,3R,4S,4aR)-2,3,4,7-Tetrahydroxy-3,4,4a,5-tetrahydro-2H-[1,3]dioxolo[4,5-j]phenanthridin-6-one NARCICLASINE | cid_619061
TypeSmall organic molecule
Emp. Form.C14H13NO7
Mol. Mass.307.2555
SMILESO[C@H]1C=C2[C@@H](NC(=O)c3c(O)c4OCOc4cc23)[C@H](O)[C@@H]1O