Reaction Details
TargetMu-type opioid receptor
LigandBDBM50378888
Substrate/Competitorn/a
Meas. Tech.ChEMBL_717377 (CHEMBL1670099)
Ki 4500±n/a nM
Citation Balboni, GSalvadori, SMarczak, EDKnapp, BIBidlack, JMLazarus, LHPeng, XSi, YGNeumeyer, JL Opioid bifunctional ligands from morphine and the opioid pharmacophore Dmt-Tic. Eur J Med Chem46:799-803 (2011) 
 
Mu-type opioid receptor
Name:Mu-type opioid receptor
Type:G Protein-Coupled Receptor (GPCR)
Mol. Mass.:44789.51
Organism:Homo sapiens (Human)
Description:P35372
Residue:400
BDBM50378888
NameBDBM50378888
Synonyms:CHEMBL1743603
TypeSmall organic molecule
Emp. Form.C26H33N3O5
Mol. Mass.467.5573
SMILESCN(C)[C@@H](Cc1c(C)cc(O)cc1C)C(=O)N1Cc2ccccc2C[C@H]1C(=O)NCCC(O)=O