Reaction Details
TargetKappa-type opioid receptor
LigandBDBM50378889
Substrate/Competitorn/a
Meas. Tech.ChEMBL_717386 (CHEMBL1670108)
EC50 20±n/a nM
Citation Balboni, GSalvadori, SMarczak, EDKnapp, BIBidlack, JMLazarus, LHPeng, XSi, YGNeumeyer, JL Opioid bifunctional ligands from morphine and the opioid pharmacophore Dmt-Tic. Eur J Med Chem46:799-803 (2011) 
 
Kappa-type opioid receptor
Name:Kappa-type opioid receptor
Type:G Protein-Coupled Receptor (GPCR)
Mol. Mass.:42648.76
Organism:Homo sapiens (Human)
Description:P41145
Residue:380
BDBM50378889
NameBDBM50378889
Synonyms:CHEMBL1743605
TypeSmall organic molecule
Emp. Form.C43H52N4O7
Mol. Mass.736.8956
SMILESCN(C)[C@@H](Cc1c(C)cc(O)cc1C)C(=O)N1Cc2ccccc2C[C@H]1C(=O)NCCC(=O)OC1=C2O[C@H]3[C@@H](O)C=C[C@H]4[C@H]5CC(C=C1)C2[C@@]34CCN5C