Reaction Details
TargetP2X purinoceptor 4
LigandBDBM50336771
Substrate/Competitorn/a
Meas. Tech.ChEMBL_718658 (CHEMBL1680809)
IC50>10000±n/a nM
Citation Baqi, YHausmann, RRosefort, CRettinger, JSchmalzing, GMüller, CE Discovery of potent competitive antagonists and positive modulators of the P2X2 receptor. J Med Chem54:817-30 (2012) 
 
P2X purinoceptor 4
Name:P2X purinoceptor 4
Type:Enzyme Catalytic Domain
Mol. Mass.:43504.16
Organism:RAT
Description:Purinergic, P2X4 0 RAT::P51577
Residue:388
BDBM50336771
NameBDBM50336771
Synonyms:CHEMBL604158 | sodium 1-amino-4-(4-fluorophenylamino)-9,10-dioxo-9,10-dihydroanthracene-2-sulfonate
TypeSmall organic molecule
Emp. Form.C20H12FN2O5S
Mol. Mass.411.384
SMILESNc1c(cc(Nc2ccc(F)cc2)c2C(=O)c3ccccc3C(=O)c12)S([O-])(=O)=O