Reaction Details
TargetMetabotropic glutamate receptor 5
LigandBDBM50336831
Substrate/Competitorn/a
Meas. Tech.ChEMBL_718850 (CHEMBL1681232)
Ki 0.400000±n/a nM
Citation Siméon, FGWendahl, MTPike, VW Syntheses of 2-amino and 2-halothiazole derivatives as high-affinity metabotropic glutamate receptor subtype 5 ligands and potential radioligands for in vivo imaging. J Med Chem54:901-8 (2012) 
 
Metabotropic glutamate receptor 5
Name:Metabotropic glutamate receptor 5
Type:Enzyme
Mol. Mass.:131900.14
Organism:Rattus norvegicus (Rat)
Description:P31424
Residue:1203
BDBM50336831
NameBDBM50336831
Synonyms:3-((2-Chlorothiazol)-4-yl)ethynyl)-5-fluorobenzonitrile | CHEMBL1672276
TypeSmall organic molecule
Emp. Form.C12H4ClFN2S
Mol. Mass.262.69
SMILESFc1cc(cc(c1)C#Cc1csc(Cl)n1)C#N