Reaction Details
TargetMetabotropic glutamate receptor 5
LigandBDBM50336842
Substrate/Competitorn/a
Meas. Tech.ChEMBL_718850 (CHEMBL1681232)
Ki 1.6±n/a nM
Citation Siméon, FGWendahl, MTPike, VW Syntheses of 2-amino and 2-halothiazole derivatives as high-affinity metabotropic glutamate receptor subtype 5 ligands and potential radioligands for in vivo imaging. J Med Chem54:901-8 (2012) 
 
Metabotropic glutamate receptor 5
Name:Metabotropic glutamate receptor 5
Type:Enzyme
Mol. Mass.:131900.14
Organism:Rattus norvegicus (Rat)
Description:P31424
Residue:1203
BDBM50336842
NameBDBM50336842
Synonyms:3-((2-Fluorothiazol-4-yl)ethynyl)benzonitrile | CHEMBL1672287
TypeSmall organic molecule
Emp. Form.C12H5FN2S
Mol. Mass.228.245
SMILESFc1nc(cs1)C#Cc1cccc(c1)C#N