Reaction Details
TargetMetabotropic glutamate receptor 5
LigandBDBM50336844
Substrate/Competitorn/a
Meas. Tech.ChEMBL_718850 (CHEMBL1681232)
Ki 3.9±n/a nM
Citation Siméon, FGWendahl, MTPike, VW Syntheses of 2-amino and 2-halothiazole derivatives as high-affinity metabotropic glutamate receptor subtype 5 ligands and potential radioligands for in vivo imaging. J Med Chem54:901-8 (2012) 
 
Metabotropic glutamate receptor 5
Name:Metabotropic glutamate receptor 5
Type:Enzyme
Mol. Mass.:131900.14
Organism:Rattus norvegicus (Rat)
Description:P31424
Residue:1203
BDBM50336844
NameBDBM50336844
Synonyms:2-(3-((2-Fluorothiazol-4-yl)ethynyl)phenyl)acetonitrile | CHEMBL1672289
TypeSmall organic molecule
Emp. Form.C13H7FN2S
Mol. Mass.242.271
SMILESFc1nc(cs1)C#Cc1cccc(CC#N)c1