Reaction Details
TargetMitogen-activated protein kinase 7
LigandBDBM50337136
Substrate/Competitorn/a
Meas. Tech.ChEMBL_719091 (CHEMBL1679302)
IC50 320±n/a nM
Citation Deng, XYang, QKwiatkowski, NSim, TMcDermott, USettleman, JELee, JDGray, NS Discovery of a benzo[e]pyrimido-[5,4-b][1,4]diazepin-6(11H)-one as a Potent and Selective Inhibitor of Big MAP Kinase 1. ACS Med Chem Lett2:195-200 (2011) 
 
Mitogen-activated protein kinase 7
Name:Mitogen-activated protein kinase 7
Type:Protein
Mol. Mass.:88377.36
Organism:Homo sapiens (Human)
Description:Q13164
Residue:816
BDBM50337136
NameBDBM50337136
Synonyms:4-((5,11-dimethyl-6-oxo-6,11-dihydro-5H-benzo[e]pyrimido[5,4-b][1,4]diazepin-2-yl)amino)-3-methoxy-N-(1-methylpiperidin-4-yl)benzamide | CHEMBL1673048
TypeSmall organic molecule
Emp. Form.C27H31N7O3
Mol. Mass.501.5801
SMILESCOc1cc(ccc1Nc1ncc2N(C)C(=O)c3ccccc3N(C)c2n1)C(=O)NC1CCN(C)CC1