Reaction Details
TargetMitogen-activated protein kinase 7
LigandBDBM50337139
Substrate/Competitorn/a
Meas. Tech.ChEMBL_719091 (CHEMBL1679302)
IC50 200±n/a nM
Citation Deng, XYang, QKwiatkowski, NSim, TMcDermott, USettleman, JELee, JDGray, NS Discovery of a benzo[e]pyrimido-[5,4-b][1,4]diazepin-6(11H)-one as a Potent and Selective Inhibitor of Big MAP Kinase 1. ACS Med Chem Lett2:195-200 (2011) 
 
Mitogen-activated protein kinase 7
Name:Mitogen-activated protein kinase 7
Type:Protein
Mol. Mass.:88377.36
Organism:Homo sapiens (Human)
Description:Q13164
Residue:816
BDBM50337139
NameBDBM50337139
Synonyms:11-ethyl-2-((2-methoxy-4-(4-methylpiperazin-1-yl)phenyl)amino)-5-methyl-5H-benzo[e]pyrimido[5,4-b][1,4]diazepin-6(11H)-one | CHEMBL1673051
TypeSmall organic molecule
Emp. Form.C26H31N7O2
Mol. Mass.473.57
SMILESCCN1c2ccccc2C(=O)N(C)c2cnc(Nc3ccc(cc3OC)N3CCN(C)CC3)nc12