Reaction Details
TargetCaspase-3
LigandBDBM50273338
Substrate/Competitorn/a
Meas. Tech.ChEMBL_728312 (CHEMBL1687572)
IC50 0.5±n/a nM
Citation Jiang, YHansen, TV Isatin 1,2,3-triazoles as potent inhibitors against caspase-3. Bioorg Med Chem Lett21:1626-9 (2011) 
 
Caspase-3
Name:Caspase-3
Type:Hydrolase; heterotetramer of two heterodimers
Mol. Mass.:31607.55
Organism:Homo sapiens (Human)
Description:n/a
Residue:277
BDBM50273338
NameBDBM50273338
Synonyms:(S)-1-((1-(2-Fluoroethyl)-1H-[1,2,3]-triazol-4-yl)methyl)-5-(2(2,4-difluorophenoxymethyl)-pyrrolidine-1-sulfonyl)isatin | CHEMBL456799
TypeSmall organic molecule
Emp. Form.C24H22F3N5O5S
Mol. Mass.549.522
SMILESFCCn1cc(CN2C(=O)C(=O)c3cc(ccc23)S(=O)(=O)N2CCC[C@H]2COc2ccc(F)cc2F)nn1