Reaction Details
TargetTranslocator protein
LigandBDBM50342049
Substrate/Competitorn/a
Meas. Tech.ChEMBL_743741 (CHEMBL1767555)
Ki 2800±n/a nM
Citation Donohue, SRDannals, RFHalldin, CPike, VW N-(4-cyanotetrahydro-2H-pyran-4-yl) and N-(1-cyanocyclohexyl) derivatives of 1,5-diarylpyrazole-3-carboxamides showing high affinity for 18 kDa translocator protein and/or cannabinoid receptors. J Med Chem54:2961-70 (2011) 
 
Translocator protein
Name:Translocator protein
Type:Mitochondrion membrane protein
Mol. Mass.:18945.84
Organism:Rattus norvegicus (rat)
Description:Competitive binding experiments were performed on rat kidney mitochondrial membranes.
Residue:169
BDBM50342049
NameBDBM50342049
Synonyms:CHEMBL1765681 | N-(4-Cyanotetrahydro-2H-pyran-4-yl)-1-(2-phenylphenyl)-4-methyl-5-phenyl-1H-pyrazole-3-carboxamide
TypeSmall organic molecule
Emp. Form.C29H26N4O2
Mol. Mass.462.5423
SMILESCc1c(nn(c1-c1ccccc1)-c1ccccc1-c1ccccc1)C(=O)NC1(CCOCC1)C#N