Reaction Details
TargetCannabinoid receptor 1
LigandBDBM50342052
Substrate/Competitorn/a
Meas. Tech.ChEMBL_743739 (CHEMBL1767553)
Ki>10000±n/a nM
Citation Donohue, SRDannals, RFHalldin, CPike, VW N-(4-cyanotetrahydro-2H-pyran-4-yl) and N-(1-cyanocyclohexyl) derivatives of 1,5-diarylpyrazole-3-carboxamides showing high affinity for 18 kDa translocator protein and/or cannabinoid receptors. J Med Chem54:2961-70 (2011) 
 
Cannabinoid receptor 1
Name:Cannabinoid receptor 1
Type:G Protein-Coupled Receptor (GPCR)
Mol. Mass.:52868.96
Organism:Homo sapiens (Human)
Description:P21554
Residue:472
BDBM50342052
NameBDBM50342052
Synonyms:1-(2-Chlorophenyl)-N-(4-cyanotetrahydro-2H-pyran-4-yl)-N,4-dimethyl-5-phenyl-1H-pyrazole-3-carboxamide | CHEMBL1765096
TypeSmall organic molecule
Emp. Form.C24H23ClN4O2
Mol. Mass.434.918
SMILESCN(C(=O)c1nn(c(c1C)-c1ccccc1)-c1ccccc1Cl)C1(CCOCC1)C#N