Reaction Details
TargetCannabinoid receptor 1
LigandBDBM50342043
Substrate/Competitorn/a
Meas. Tech.ChEMBL_743739 (CHEMBL1767553)
Ki>10000±n/a nM
Citation Donohue, SRDannals, RFHalldin, CPike, VW N-(4-cyanotetrahydro-2H-pyran-4-yl) and N-(1-cyanocyclohexyl) derivatives of 1,5-diarylpyrazole-3-carboxamides showing high affinity for 18 kDa translocator protein and/or cannabinoid receptors. J Med Chem54:2961-70 (2011) 
 
Cannabinoid receptor 1
Name:Cannabinoid receptor 1
Type:G Protein-Coupled Receptor (GPCR)
Mol. Mass.:52868.96
Organism:Homo sapiens (Human)
Description:P21554
Residue:472
BDBM50342043
NameBDBM50342043
Synonyms:1-(3-Bromophenyl)-N-(4-cyanotetrahydro-2H-pyran-4-yl)-4-methyl-5-phenyl-1H-pyrazole-3-carboxamide | CHEMBL1765678
TypeSmall organic molecule
Emp. Form.C23H21BrN4O2
Mol. Mass.465.342
SMILESCc1c(nn(c1-c1ccccc1)-c1cccc(Br)c1)C(=O)NC1(CCOCC1)C#N