Reaction Details
TargetCannabinoid receptor 2
LigandBDBM50342051
Substrate/Competitorn/a
Meas. Tech.ChEMBL_743740 (CHEMBL1767554)
Ki>10000±n/a nM
Citation Donohue, SRDannals, RFHalldin, CPike, VW N-(4-cyanotetrahydro-2H-pyran-4-yl) and N-(1-cyanocyclohexyl) derivatives of 1,5-diarylpyrazole-3-carboxamides showing high affinity for 18 kDa translocator protein and/or cannabinoid receptors. J Med Chem54:2961-70 (2011) 
 
Cannabinoid receptor 2
Name:Cannabinoid receptor 2
Type:G Protein-Coupled Receptor (GPCR)
Mol. Mass.:39690.94
Organism:Homo sapiens (Human)
Description:P34972
Residue:360
BDBM50342051
NameBDBM50342051
Synonyms:1-(2-Chlorophenyl)-N-(4-cyanotetrahydro-2H-pyran-4-yl)-4-methyl-5-phenyl-1H-pyrazole-3-carboxamide | CHEMBL1765674
TypeSmall organic molecule
Emp. Form.C23H21ClN4O2
Mol. Mass.420.891
SMILESCc1c(nn(c1-c1ccccc1)-c1ccccc1Cl)C(=O)NC1(CCOCC1)C#N