Reaction Details
Target5-hydroxytryptamine receptor 2A
LigandBDBM50342038
Substrate/Competitorn/a
Meas. Tech.ChEMBL_743925 (CHEMBL1767919)
Ki 6280±n/a nM
Citation Donohue, SRDannals, RFHalldin, CPike, VW N-(4-cyanotetrahydro-2H-pyran-4-yl) and N-(1-cyanocyclohexyl) derivatives of 1,5-diarylpyrazole-3-carboxamides showing high affinity for 18 kDa translocator protein and/or cannabinoid receptors. J Med Chem54:2961-70 (2011) 
 
5-hydroxytryptamine receptor 2A
Name:5-hydroxytryptamine receptor 2A
Type:undefined
Mol. Mass.:52607.65
Organism:Homo sapiens (Human)
Description:P28223
Residue:471
BDBM50342038
NameBDBM50342038
Synonyms:1-(2-Bromophenyl)-N-(4-cyanotetrahydro-2H-pyran-4-yl)-5-(4-methoxyphenyl)-4-methyl-1H-pyrazole-3-carboxamide | CHEMBL1765683
TypeSmall organic molecule
Emp. Form.C24H23BrN4O3
Mol. Mass.495.368
SMILESCOc1ccc(cc1)-c1c(C)c(nn1-c1ccccc1Br)C(=O)NC1(CCOCC1)C#N