Reaction Details
TargetCannabinoid receptor 1
LigandBDBM50342044
Substrate/Competitorn/a
Meas. Tech.ChEMBL_743739 (CHEMBL1767553)
Ki 356±n/a nM
Citation Donohue, SRDannals, RFHalldin, CPike, VW N-(4-cyanotetrahydro-2H-pyran-4-yl) and N-(1-cyanocyclohexyl) derivatives of 1,5-diarylpyrazole-3-carboxamides showing high affinity for 18 kDa translocator protein and/or cannabinoid receptors. J Med Chem54:2961-70 (2011) 
 
Cannabinoid receptor 1
Name:Cannabinoid receptor 1
Type:G Protein-Coupled Receptor (GPCR)
Mol. Mass.:52868.96
Organism:Homo sapiens (Human)
Description:P21554
Residue:472
BDBM50342044
NameBDBM50342044
Synonyms:4-Bromo-1-(3-bromophenyl)-N-(4-cyanotetrahydro-2H-pyran-4-yl)-5-(4-methoxyphenyl)-1H-pyrazole-3-carboxamide | CHEMBL1765819
TypeSmall organic molecule
Emp. Form.C23H20Br2N4O3
Mol. Mass.560.238
SMILESCOc1ccc(cc1)-c1c(Br)c(nn1-c1cccc(Br)c1)C(=O)NC1(CCOCC1)C#N