Reaction Details
TargetTryptophan 2,3-dioxygenase
LigandBDBM50289137
Substrate/Competitorn/a
Meas. Tech.ChEMBL_761930 (CHEMBL1817449)
Ki 880±n/a nM
Citation Dolusic, ELarrieu, PMoineaux, LStroobant, VPilotte, LColau, DPochet, LVan den Eynde, BMasereel, BWouters, JFrédérick, R Tryptophan 2,3-dioxygenase (TDO) inhibitors. 3-(2-(pyridyl)ethenyl)indoles as potential anticancer immunomodulators. J Med Chem54:5320-34 (2011) 
 
Tryptophan 2,3-dioxygenase
Name:Tryptophan 2,3-dioxygenase
Type:PROTEIN
Mol. Mass.:47874.48
Organism:Homo sapiens (Human)
Description:ChEMBL_825691
Residue:406
BDBM50289137
NameBDBM50289137
Synonyms:6-Fluoro-3-((E)-2-pyridin-3-yl-vinyl)-1H-indole US10155972, Compound 680C91
TypeSmall organic molecule
Emp. Form.C15H11FN2
Mol. Mass.238.2596
SMILESFc1ccc2c(\C=C\c3cccnc3)c[nH]c2c1