Reaction Details
TargetAmine oxidase [flavin-containing] A
LigandBDBM100152
Substrate/Competitorn/a
Meas. Tech.ChEMBL_761934 (CHEMBL1817453)
Ki 17±n/a nM
Citation Dolusic, ELarrieu, PMoineaux, LStroobant, VPilotte, LColau, DPochet, LVan den Eynde, BMasereel, BWouters, JFrédérick, R Tryptophan 2,3-dioxygenase (TDO) inhibitors. 3-(2-(pyridyl)ethenyl)indoles as potential anticancer immunomodulators. J Med Chem54:5320-34 (2011) 
 
Amine oxidase [flavin-containing] A
Name:Amine oxidase [flavin-containing] A
Type:Protein
Mol. Mass.:59689.53
Organism:Homo sapiens (Human)
Description:P21397
Residue:527
BDBM100152
NameBDBM100152
Synonyms:7-methoxy-1-methyl-9H-beta-carboline;hydrochloride HARMINE MLS002153910 cid_5359389
TypeSmall organic molecule
Emp. Form.C13H12N2O
Mol. Mass.212.2472
SMILESCOc1ccc2c(c1)[nH]c1c(C)nccc21