Reaction Details
Target5-hydroxytryptamine receptor 1B
LigandBDBM10755
Substrate/Competitorn/a
Meas. Tech.ChEMBL_761944 (CHEMBL1817463)
Ki 14±n/a nM
Citation Dolusic, ELarrieu, PMoineaux, LStroobant, VPilotte, LColau, DPochet, LVan den Eynde, BMasereel, BWouters, JFrédérick, R Tryptophan 2,3-dioxygenase (TDO) inhibitors. 3-(2-(pyridyl)ethenyl)indoles as potential anticancer immunomodulators. J Med Chem54:5320-34 (2011) 
 
5-hydroxytryptamine receptor 1B
Name:5-hydroxytryptamine receptor 1B
Type:G Protein-Coupled Receptor (GPCR)
Mol. Mass.:43579.17
Organism:Homo sapiens (Human)
Description:Receptor binding assays were performed using human clone stably expressed in CHO cells
Residue:390
BDBM10755
NameBDBM10755
Synonyms:14C-5-hydroxy tryptamine creatinine disulfate 5-HT 5-hydroxy tryptamine creatinine disulfate Serotonin | [3H]-5-HT
TypeSmall organic molecule
Emp. Form.C10H12N2O
Mol. Mass.176.2151
SMILESNCCc1c[nH]c2ccc(O)cc12