Reaction Details
TargetTranslocator protein
LigandBDBM50350912
Substrate/Competitorn/a
Meas. Tech.ChEMBL_763591 (CHEMBL1820032)
Ki 0.44±n/a nM
Citation Damont, ABoisgard, RKuhnast, BLemée, FRaggiri, GScarf, AMDa Pozzo, ESelleri, SMartini, CTavitian, BKassiou, MDollé, F Synthesis of 6-[¹8F]fluoro-PBR28, a novel radiotracer for imaging the TSPO 18 kDa with PET. Bioorg Med Chem Lett21:4819-22 (2011) 
 
Translocator protein
Name:Translocator protein
Type:Mitochondrion membrane protein
Mol. Mass.:18945.84
Organism:Rattus norvegicus (rat)
Description:Competitive binding experiments were performed on rat kidney mitochondrial membranes.
Residue:169
BDBM50350912
NameBDBM50350912
Synonyms:CHEMBL1817978
TypeSmall organic molecule
Emp. Form.C21H19FN2O3
Mol. Mass.366.3856
SMILESCOc1ccccc1CN(C(C)=O)c1cnc(F)cc1Oc1ccccc1