Reaction Details
TargetGlutathione reductase, mitochondrial
LigandBDBM17657
Substrate/Competitorn/a
Meas. Tech.ChEMBL_767322 (CHEMBL1825434)
IC50 53700±n/a nM
Citation Çakmak, RDurdagi, SEkinci, DSentürk, MTopal, G Design, synthesis and biological evaluation of novel nitroaromatic compounds as potent glutathione reductase inhibitors. Bioorg Med Chem Lett21:5398-402 (2011) 
 
Glutathione reductase, mitochondrial
Name:Glutathione reductase, mitochondrial
Type:Enzyme
Mol. Mass.:56271.52
Organism:Homo sapiens (Human)
Description:P00390
Residue:522
BDBM17657
NameBDBM17657
Synonyms:(2S)-2-aminopentanedioic acid D-Glutamate L-Glu L-Glutamic acid L-gluatmate
TypeAmino Acid
Emp. Form.C5H9NO4
Mol. Mass.147.1293
SMILESN[C@@H](CCC(O)=O)C(O)=O