Reaction Details
TargetHistamine H3 receptor
LigandBDBM50353172
Substrate/Competitorn/a
Meas. Tech.ChEMBL_768592 (CHEMBL1832611)
Ki 5.8±n/a nM
Citation Hudkins, RLAimone, LDBailey, TRBendesky, RJDandu, RRDunn, DGruner, JAJosef, KALin, YGLyons, JMarcy, VRMathiasen, JRSundar, BGTao, MZulli, ALRaddatz, RBacon, ER Identification of pyridazin-3-one derivatives as potent, selective histamine H3 receptor inverse agonists with robust wake activity. Bioorg Med Chem Lett21:5493-7 (2011) 
 
Histamine H3 receptor
Name:Histamine H3 receptor
Type:G Protein-Coupled Receptor (GPCR)
Mol. Mass.:48691.47
Organism:Homo sapiens (Human)
Description:Binding assays were using CHO cells stably expressing hH3R receptors.
Residue:445
BDBM50353172
NameBDBM50353172
Synonyms:CHEMBL1829477
TypeSmall organic molecule
Emp. Form.C19H24FN3O2
Mol. Mass.345.4112
SMILESC[C@@H]1CCCN1CCCOc1ccc(cc1F)-c1ccc(=O)n(C)n1