Reaction Details
TargetDNA nucleotidylexotransferase
LigandBDBM50356643
Substrate/Competitorn/a
Meas. Tech.ChEMBL_785409 (CHEMBL1919788)
IC50 11900±n/a nM
Citation Maruo, SKuriyama, IKuramochi, KTsubaki, KYoshida, HMizushina, Y Inhibitory effect of novel 5-O-acyl juglones on mammalian DNA polymerase activity, cancer cell growth and inflammatory response. Bioorg Med Chem19:5803-12 (2011) 
 
DNA nucleotidylexotransferase
Name:DNA nucleotidylexotransferase
Type:PROTEIN
Mol. Mass.:58304.95
Organism:Bos taurus
Description:ChEMBL_1297318
Residue:509
BDBM50356643
NameBDBM50356643
Synonyms:CHEMBL1917198
TypeSmall organic molecule
Emp. Form.C28H38O4
Mol. Mass.438.5989
SMILESCCCCCCCC\C=C/CCCCCCCC(=O)Oc1cccc2C(=O)C=CC(=O)c12