Reaction Details
TargetPolyamine deacetylase HDAC10
LigandBDBM50379131
Substrate/Competitorn/a
Meas. Tech.ChEMBL_809826 (CHEMBL2014763)
IC50 150±n/a nM
Citation Hutt, DMOlsen, CAVickers, CJHerman, DChalfant, MMontero, ALeman, LJBurkle, RMaryanoff, BEBalch, WEGhadiri, MR Potential Agents for Treating Cystic Fibrosis: Cyclic Tetrapeptides that Restore Trafficking and Activity of ¿F508-CFTR. ACS Med Chem Lett2:703-707 (2011) 
 
Polyamine deacetylase HDAC10
Name:Polyamine deacetylase HDAC10
Type:Chromatin regulator; hydrolase; repressor
Mol. Mass.:71431.89
Organism:Homo sapiens (Human)
Description:Q969S8
Residue:669
BDBM50379131
NameBDBM50379131
Synonyms:CHEMBL2012815
TypeSmall organic molecule
Emp. Form.C33H46N4O5
Mol. Mass.578.7421
SMILESCCC(=O)CCCCC[C@@H]1NC(=O)[C@H](C)NC(=O)C[C@H](CC(C)C)NC(=O)[C@H](Cc2cccc3ccccc23)NC1=O