Reaction Details
TargetHistone deacetylase 1
LigandBDBM50302076
Substrate/Competitorn/a
Meas. Tech.ChEMBL_812542 (CHEMBL2014417)
IC50 120±n/a nM
Citation Hutt, DMOlsen, CAVickers, CJHerman, DChalfant, MMontero, ALeman, LJBurkle, RMaryanoff, BEBalch, WEGhadiri, MR Potential Agents for Treating Cystic Fibrosis: Cyclic Tetrapeptides that Restore Trafficking and Activity of ¿F508-CFTR. ACS Med Chem Lett2:703-707 (2011) 
 
Histone deacetylase 1
Name:Histone deacetylase 1
Type:Enzyme
Mol. Mass.:55090.27
Organism:Homo sapiens (Human)
Description:Q13547
Residue:482
BDBM50302076
NameBDBM50302076
Synonyms:6-((2S,5S,8S,11S)-8-((1H-indol-3-yl)methyl)-11-isobutyl-2-methyl-3,6,9,13-tetraoxo-1,4,7,10-tetraazacyclotridecan-5-yl)hexanoic acid | CHEMBL570490
TypeSmall organic molecule
Emp. Form.C29H41N5O6
Mol. Mass.555.6657
SMILESCC(C)C[C@H]1CC(=O)N[C@@H](C)C(=O)N[C@@H](CCCCCC(O)=O)C(=O)N[C@@H](Cc2c[nH]c3ccccc23)C(=O)N1