Reaction Details
TargetHistone deacetylase 1
LigandBDBM50379129
Substrate/Competitorn/a
Meas. Tech.ChEMBL_812542 (CHEMBL2014417)
IC50 12±n/a nM
Citation Hutt, DMOlsen, CAVickers, CJHerman, DChalfant, MMontero, ALeman, LJBurkle, RMaryanoff, BEBalch, WEGhadiri, MR Potential Agents for Treating Cystic Fibrosis: Cyclic Tetrapeptides that Restore Trafficking and Activity of ¿F508-CFTR. ACS Med Chem Lett2:703-707 (2011) 
 
Histone deacetylase 1
Name:Histone deacetylase 1
Type:Enzyme
Mol. Mass.:55090.27
Organism:Homo sapiens (Human)
Description:Q13547
Residue:482
BDBM50379129
NameBDBM50379129
Synonyms:CHEMBL2012814
TypeSmall organic molecule
Emp. Form.C33H47N5O5
Mol. Mass.593.7568
SMILESCCC(=O)CCCCC[C@@H]1NC(=O)[C@@H]2CCCN2C(=O)C[C@H](CC(C)C)NC(=O)[C@H](Cc2c[nH]c3ccccc23)NC1=O