Reaction Details
TargetHistone deacetylase 1
LigandBDBM50379131
Substrate/Competitorn/a
Meas. Tech.ChEMBL_812542 (CHEMBL2014417)
IC50 8±n/a nM
Citation Hutt, DMOlsen, CAVickers, CJHerman, DChalfant, MMontero, ALeman, LJBurkle, RMaryanoff, BEBalch, WEGhadiri, MR Potential Agents for Treating Cystic Fibrosis: Cyclic Tetrapeptides that Restore Trafficking and Activity of ¿F508-CFTR. ACS Med Chem Lett2:703-707 (2011) 
 
Histone deacetylase 1
Name:Histone deacetylase 1
Type:Enzyme
Mol. Mass.:55090.27
Organism:Homo sapiens (Human)
Description:Q13547
Residue:482
BDBM50379131
NameBDBM50379131
Synonyms:CHEMBL2012815
TypeSmall organic molecule
Emp. Form.C33H46N4O5
Mol. Mass.578.7421
SMILESCCC(=O)CCCCC[C@@H]1NC(=O)[C@H](C)NC(=O)C[C@H](CC(C)C)NC(=O)[C@H](Cc2cccc3ccccc23)NC1=O