Reaction Details
TargetHistone deacetylase 6
LigandBDBM50302073
Substrate/Competitorn/a
Meas. Tech.ChEMBL_809835 (CHEMBL2014772)
IC50 70±n/a nM
Citation Hutt, DMOlsen, CAVickers, CJHerman, DChalfant, MMontero, ALeman, LJBurkle, RMaryanoff, BEBalch, WEGhadiri, MR Potential Agents for Treating Cystic Fibrosis: Cyclic Tetrapeptides that Restore Trafficking and Activity of ¿F508-CFTR. ACS Med Chem Lett2:703-707 (2011) 
 
Histone deacetylase 6
Name:Histone deacetylase 6
Type:Chromatin regulator; hydrolase; repressor
Mol. Mass.:131381.51
Organism:Homo sapiens (Human)
Description:Q9UBN7
Residue:1215
BDBM50302073
NameBDBM50302073
Synonyms:6-((2S,5S,8S,11S)-8-((1H-indol-3-yl)methyl)-2-benzyl-11-isobutyl-3,6,9,13-tetraoxo-1,4,7,10-tetraazacyclotridecan-5-yl)-N-hydroxyhexanamide | CHEMBL566637
TypeSmall organic molecule
Emp. Form.C35H46N6O6
Mol. Mass.646.7763
SMILESCC(C)C[C@H]1CC(=O)N[C@@H](Cc2ccccc2)C(=O)N[C@@H](CCCCCC(=O)NO)C(=O)N[C@@H](Cc2c[nH]c3ccccc23)C(=O)N1