Reaction Details
TargetAurora kinase B
LigandBDBM50379363
Substrate/Competitorn/a
Meas. Tech.ChEMBL_811982 (CHEMBL2013352)
IC50 13±n/a nM
Citation Wang, TBlock, MACowen, SDavies, AMDevereaux, EGingipalli, LJohannes, JLarsen, NASu, QTucker, JAWhitston, DWu, JZhang, HJZinda, MChuaqui, C Discovery of azabenzimidazole derivatives as potent, selective inhibitors of TBK1/IKKe kinases. Bioorg Med Chem Lett22:2063-9 (2012) 
 
Aurora kinase B
Name:Aurora kinase B
Type:Protein
Mol. Mass.:39327.72
Organism:Homo sapiens (Human)
Description:Q96GD4
Residue:344
BDBM50379363
NameBDBM50379363
Synonyms:CHEMBL2011941
TypeSmall organic molecule
Emp. Form.C27H35BrN6O2
Mol. Mass.555.51
SMILESBrc1cnc2nc([nH]c2c1NCCCNC(=O)C1CCC1)-c1ccc(OCCN2CCCCC2)cc1