Reaction Details
TargetAurora kinase B
LigandBDBM50379339
Substrate/Competitorn/a
Meas. Tech.ChEMBL_811982 (CHEMBL2013352)
IC50 4±n/a nM
Citation Wang, TBlock, MACowen, SDavies, AMDevereaux, EGingipalli, LJohannes, JLarsen, NASu, QTucker, JAWhitston, DWu, JZhang, HJZinda, MChuaqui, C Discovery of azabenzimidazole derivatives as potent, selective inhibitors of TBK1/IKKe kinases. Bioorg Med Chem Lett22:2063-9 (2012) 
 
Aurora kinase B
Name:Aurora kinase B
Type:Protein
Mol. Mass.:39327.72
Organism:Homo sapiens (Human)
Description:Q96GD4
Residue:344
BDBM50379339
NameBDBM50379339
Synonyms:CHEMBL2011940
TypeSmall organic molecule
Emp. Form.C20H23BrN6O
Mol. Mass.443.34
SMILESNc1cccc(c1)-c1nc2ncc(Br)c(NCCCNC(=O)C3CCC3)c2[nH]1