Reaction Details
TargetSerine/threonine-protein kinase TBK1
LigandBDBM50379359
Substrate/Competitorn/a
Meas. Tech.ChEMBL_811985 (CHEMBL2013355)
IC50 8±n/a nM
Citation Wang, TBlock, MACowen, SDavies, AMDevereaux, EGingipalli, LJohannes, JLarsen, NASu, QTucker, JAWhitston, DWu, JZhang, HJZinda, MChuaqui, C Discovery of azabenzimidazole derivatives as potent, selective inhibitors of TBK1/IKKe kinases. Bioorg Med Chem Lett22:2063-9 (2012) 
 
Serine/threonine-protein kinase TBK1
Name:Serine/threonine-protein kinase TBK1
Type:protein
Mol. Mass.:83645.20
Organism:Homo sapiens (Human)
Description:Q9UHD2
Residue:729
BDBM50379359
NameBDBM50379359
Synonyms:CHEMBL2011935
TypeSmall organic molecule
Emp. Form.C21H24BrN5O3
Mol. Mass.474.351
SMILESCOc1ccc(cc1)-c1nc2ncc(Br)c(NCCCNC(=O)C3CC(O)C3)c2[nH]1