Reaction Details
TargetSerine/threonine-protein kinase TBK1
LigandBDBM50379337
Substrate/Competitorn/a
Meas. Tech.ChEMBL_811985 (CHEMBL2013355)
IC50 10±n/a nM
Citation Wang, TBlock, MACowen, SDavies, AMDevereaux, EGingipalli, LJohannes, JLarsen, NASu, QTucker, JAWhitston, DWu, JZhang, HJZinda, MChuaqui, C Discovery of azabenzimidazole derivatives as potent, selective inhibitors of TBK1/IKKe kinases. Bioorg Med Chem Lett22:2063-9 (2012) 
 
Serine/threonine-protein kinase TBK1
Name:Serine/threonine-protein kinase TBK1
Type:protein
Mol. Mass.:83645.20
Organism:Homo sapiens (Human)
Description:Q9UHD2
Residue:729
BDBM50379337
NameBDBM50379337
Synonyms:CHEMBL2011936
TypeSmall organic molecule
Emp. Form.C22H26BrN5O2
Mol. Mass.472.378
SMILESCOc1ccc(cc1)-c1nc2ncc(Br)c(NCCCNC(=O)C3CCCC3)c2[nH]1