Reaction Details
TargetSerine/threonine-protein kinase TBK1
LigandBDBM50379363
Substrate/Competitorn/a
Meas. Tech.ChEMBL_811985 (CHEMBL2013355)
IC50 4±n/a nM
Citation Wang, TBlock, MACowen, SDavies, AMDevereaux, EGingipalli, LJohannes, JLarsen, NASu, QTucker, JAWhitston, DWu, JZhang, HJZinda, MChuaqui, C Discovery of azabenzimidazole derivatives as potent, selective inhibitors of TBK1/IKKe kinases. Bioorg Med Chem Lett22:2063-9 (2012) 
 
Serine/threonine-protein kinase TBK1
Name:Serine/threonine-protein kinase TBK1
Type:protein
Mol. Mass.:83645.20
Organism:Homo sapiens (Human)
Description:Q9UHD2
Residue:729
BDBM50379363
NameBDBM50379363
Synonyms:CHEMBL2011941
TypeSmall organic molecule
Emp. Form.C27H35BrN6O2
Mol. Mass.555.51
SMILESBrc1cnc2nc([nH]c2c1NCCCNC(=O)C1CCC1)-c1ccc(OCCN2CCCCC2)cc1