Reaction Details
TargetSerine/threonine-protein kinase TBK1
LigandBDBM50379365
Substrate/Competitorn/a
Meas. Tech.ChEMBL_811985 (CHEMBL2013355)
IC50 9±n/a nM
Citation Wang, TBlock, MACowen, SDavies, AMDevereaux, EGingipalli, LJohannes, JLarsen, NASu, QTucker, JAWhitston, DWu, JZhang, HJZinda, MChuaqui, C Discovery of azabenzimidazole derivatives as potent, selective inhibitors of TBK1/IKKe kinases. Bioorg Med Chem Lett22:2063-9 (2012) 
 
Serine/threonine-protein kinase TBK1
Name:Serine/threonine-protein kinase TBK1
Type:protein
Mol. Mass.:83645.20
Organism:Homo sapiens (Human)
Description:Q9UHD2
Residue:729
BDBM50379365
NameBDBM50379365
Synonyms:CHEMBL2011943
TypeSmall organic molecule
Emp. Form.C23H28N6O3
Mol. Mass.436.5068
SMILESCOc1ccc(cc1)-c1nc2ncc(C(N)=O)c(NCCCNC(=O)C3CCCC3)c2[nH]1