Reaction Details
TargetCyclin-dependent kinase 2
LigandBDBM50379339
Substrate/Competitorn/a
Meas. Tech.ChEMBL_811986 (CHEMBL2013356)
IC50 155±n/a nM
Citation Wang, TBlock, MACowen, SDavies, AMDevereaux, EGingipalli, LJohannes, JLarsen, NASu, QTucker, JAWhitston, DWu, JZhang, HJZinda, MChuaqui, C Discovery of azabenzimidazole derivatives as potent, selective inhibitors of TBK1/IKKe kinases. Bioorg Med Chem Lett22:2063-9 (2012) 
 
Cyclin-dependent kinase 2
Name:Cyclin-dependent kinase 2
Type:Enzyme Subunit
Mol. Mass.:33938.17
Organism:Homo sapiens (Human)
Description:P24941
Residue:298
BDBM50379339
NameBDBM50379339
Synonyms:CHEMBL2011940
TypeSmall organic molecule
Emp. Form.C20H23BrN6O
Mol. Mass.443.34
SMILESNc1cccc(c1)-c1nc2ncc(Br)c(NCCCNC(=O)C3CCC3)c2[nH]1