Reaction Details
TargetCyclin-dependent kinase 2
LigandBDBM50379364
Substrate/Competitorn/a
Meas. Tech.ChEMBL_811986 (CHEMBL2013356)
IC50 9410±n/a nM
Citation Wang, TBlock, MACowen, SDavies, AMDevereaux, EGingipalli, LJohannes, JLarsen, NASu, QTucker, JAWhitston, DWu, JZhang, HJZinda, MChuaqui, C Discovery of azabenzimidazole derivatives as potent, selective inhibitors of TBK1/IKKe kinases. Bioorg Med Chem Lett22:2063-9 (2012) 
 
Cyclin-dependent kinase 2
Name:Cyclin-dependent kinase 2
Type:Enzyme Subunit
Mol. Mass.:33938.17
Organism:Homo sapiens (Human)
Description:P24941
Residue:298
BDBM50379364
NameBDBM50379364
Synonyms:CHEMBL2011942
TypeSmall organic molecule
Emp. Form.C28H37N7O3
Mol. Mass.519.6385
SMILESNC(=O)c1cnc2nc([nH]c2c1NCCCNC(=O)C1CCC1)-c1ccc(OCCN2CCCCC2)cc1